Home > Cannot Find > I686-pc-cygwin/bin/ld Cannot Find

I686-pc-cygwin/bin/ld Cannot Find

Contents

Boss sends a birthday message. Reload to refresh your session. Personal Open source Business Explore Sign up Sign in Pricing Blog Support Search GitHub This repository Watch 62 Star 387 Fork 166 weidai11/cryptopp Code Issues 21 Pull requests 2 Projects Easy fix that resulted in easy, almost troublefree compilation. > > I guess the real problem is that the CYGWIN variable is undefined, and I cannot find out where that define his comment is here

gopherbot added the retracted label Nov 7, 2014 vchervanev referenced this issue in nsf/termbox-go Mar 29, 2015 Open termbox-go app does not initialize on cygwin on Windows... #66 gopherbot locked and I am getting the same error while trying to "go get github.com/mattn/go-sqlite3": $ go get github.com/mattn/go-sqlite3 # github.com/mattn/go-sqlite3 /usr/lib/gcc/x86_64-pc-cygwin/4.8.3/../../../../x86_64-pc-cygwin/bin/ld: cannot find -lmingwex /usr/lib/gcc/x86_64-pc-cygwin/4.8.3/../../../../x86_64-pc-cygwin/bin/ld: cannot find -lmingw32 collect2: error: ld returned 1 There was only one compile error: > > persist.c:42: error: conflicting types for ‘sighandler_t' > /usr/include/signal.h:11: error: previous declaration of ‘sighandler_t' was here > make: *** [persist.o] Error 1 > make: when I go $PATH $ $PATH bash: /usr/local/bin:/usr/bin:/bin:/cygdrive/c/Program: No such file or directory and echo $PATH $ echo $PATH /usr/local/bin:/usr/bin:/bin:/cygdrive/c/Program Files/PC Connectivity Solution/ :/cygdrive/c/Program Files/MiKTeX 2.8/miktex/bin:/cygdrive/c/WINDOWS/system32:/c ygdrive/c/WINDOWS:/cygdrive/c/WINDOWS/System32/Wbem:/cygdrive/c/Program Files/AT I Technologies/ATI.ACE/Core-Static:/cygdrive/c/Program Files/MATLAB/R2010a/runti look at this web-site

Cygwin Gcc Cannot Find

How to reply? If you use the HEAD it should compile. make[1]: Leaving directory '/opt/postgis/postgis-2.2.0dev/libpgcommon' ---- Making all in postgis make[1]: Entering directory '/opt/postgis/postgis-2.2.0dev/postgis' gcc -ggdb -O2 -pipe -Wimplicit-function-declaration -Wall -Wmissing-prototypes -Wpointer-arith -Wdeclaration-after-statement -Wendif-labels -Wmissing-format-attribute -Wformat-security -fno-strict-aliasing -fwrapv -fexcess-precision=standard   -shared -o See What package do I need for Cygwin's UBsan?

Best regards, Czarek gopherbot commented Feb 5, 2014 Comment 1 by czarek.tomczak: The build command is: go build -o bin/cef2go.exe src/main_win.go gopherbot commented Feb 5, 2014 Comment 2 by czarek.tomczak: Turns g++ -DDEBUG -g2 -O2 -std=c++03 -fsanitize=address -march=native -pipe -c fipsalgt.cpp g++ -DDEBUG -g2 -O2 -std=c++03 -fsanitize=address -march=native -pipe -c dlltest.cpp g++ -o cryptest.exe -DDEBUG -g2 -O2 -std=c++03 -fsanitize=address -march=native -pipe bench.o wrote: Hello, I'm trying to install postgis 2.2.0dev (http://postgis.net/stuff/postgis-2.2.0dev.tar.gz), but I got an error saying: /usr/lib/gcc/i686-pc-cygwin/4.8.3/../../../../i686-pc-cygwin/bin/ld: cannot find -lpostgres collect2: error: ld returned 1 exit status /usr/lib/postgresql/pgxs/src/makefiles/../../src/Makefile.shlib:377: recipe for target 'postgis-2.2.dll' We recommend upgrading to the latest Safari, Google Chrome, or Firefox.

Terms Privacy Security Status Help You can't perform that action at this time. Cygwin Cannot Find Lmingw32 Also see What package do I need for Cygwin's UBsan? US Election results 2016 : what went wrong with prediction models GO OUT AND VOTE Ubuntu 16.04 installer cant see SSD drive What does "there lived here then" mean? https://cygwin.com/ml/cygwin/2002-03/msg01073.html noloader closed this Oct 31, 2015 noloader added enhancement wontfix labels Oct 31, 2015 noloader self-assigned this Oct 31, 2015 noloader added gcc-5 can't fix and removed won't fix labels Jan

cryptopp collaborator noloader commented Oct 31, 2015 This appears to be a bug with Cygwin. Why is (a % 256) different than (a & 0xFF)? Check if an item is in a nested list Do humans have an ethical obligation to prevent animal on animal violence? There's nothing in usr/local/bin,  usr/local/include, usr/local/lib, they're empty directories.  This is odd.

Cygwin Cannot Find Lmingw32

They are put in separate directories for a reason. https://gcc.gnu.org/ml/gcc-help/2013-09/msg00014.html Index Nav: [DateIndex] [SubjectIndex] [AuthorIndex] [ThreadIndex] Message Nav: [DatePrev][DateNext] [ThreadPrev][ThreadNext] Other format: [Raw text] gcc, installation & compiling within cywin structure From: Mark Sheffield To: "gcc-help Cygwin Gcc Cannot Find only copy the kannel libs didn't work. X86_64 Pc Cygwin Bin Ld Cannot Find but can't find them in the install.

What do I do? this content Contact GitHub API Training Shop Blog About © 2016 GitHub, Inc. Personal Open source Business Explore Sign up Sign in Pricing Blog Support Search GitHub This repository Watch 1,853 Star 21,883 Fork 2,884 golang/go Code Issues 2,407 Pull requests 1 Projects I am seen in darkness and in light, What am I?

Anyway, I did as you suggested and almost everything compiled. installed all libs via cygwin setup-x86.exe which library am I missing. You signed out in another tab or window. http://tcsmacs.net/cannot-find/ld-exe-cannot-find-ldl.php current community blog chat Super User Meta Super User your communities Sign up or log in to customize your list.

Report message to a moderator Previous Topic:how to debug a program with root priviledge on eclipse CDT? Why is (a % 256) different than (a & 0xFF)? on Stack Overflow.

You signed in with another tab or window.

Powered by: FUDforum 3.0.2.Copyright ©2001-2010 FUDforum Bulletin Board Software

Back to the top Eclipse Foundation About us Contact Us Donate Governance Logo and Artwork Board of Directors Legal Privacy Policy How can I solve that? Why is looping over find's output bad practice? current community chat Stack Overflow Meta Stack Overflow your communities Sign up or log in to customize your list.

more hot questions question feed about us tour help blog chat data legal privacy policy work here advertising info mobile contact us feedback Technology Life / Arts Culture / Recreation Science Please do not comment on this issue again, it is closed. Any chance of an easy fix? check over here asked 5 years ago viewed 5795 times active 5 years ago Upcoming Events 2016 Community Moderator Election ends Nov 22 Visit Chat Related 35Why does GCC-Windows depend on cygwin?3Dealing with “C

Next Topic:Urgent help with invalid project path: duplicate path etc Goto Forum: - NewcomersNewcomers- Language IDEsAJDTAndmoreC / C++ IDE (CDT)CheJava Development Tools (JDT)ObjectteamsOrionPHP Development Tools (PDT)Eclipse Web Tools Platform Project (WTP)ServerTools If you are building with mingw features you either should use -mno-cygwin (pre-gcc4) or a mingw cross compiler (which is available in the cygwin installer 'setup.exe'). –thoni56 Aug 24 '12 at I suggest asking for assistance on the go-nuts mailing list, or raising an issue on the go-sqlite3 project on github. After download and install of cygwin, putting these lines into .bashrc:      export LD_LIBRARY_PATH=/usr/local/lib      export LIBRARY_PATH=/usr/local/lib      export CPATH=/usr/local/include And then setting the path in the system

We recommend upgrading to the latest Safari, Google Chrome, or Firefox. Are there any instructions of how to compile Radiance under MinGW? > > Christoph > > > From: radiance-general-bounces at radiance-online.org [mailto:radiance-general-bounces at radiance-online.org] On Behalf Of Claus Brøndgaard Madsen > Reload to refresh your session. I've set library paths: export LD_LIBRARY_PATH=/lib export LIBRARY_PATH=/lib export CPATH=/usr/include export PATH=/usr/local/bin:/usr/bin:/bin:/usr/sbin:/cygdrive/c/WINDOWS/system32:/cygdrive/c/WINDOWS /lib and /usr/include are populated with what looks to be like a reasonable set of directories, but I really

Page generated in 0.01599 seconds .:: Contact :: Home ::. asked 2 years ago viewed 96 times active 2 years ago Related 0Error running gcc on cygwin (bad adress)2How to compile gcc-4.0 on Mountain Lion0Cygwin - gcc-java installed but cannot call4gcc You signed out in another tab or window. J > > Best > Claus > > > ================================== stderr ============================================= > > ezxml.c: In function ‘ezxml_parse_fd': > > ezxml.c:643: error: ‘MADV_SEQUENTIAL' undeclared (first use in this function) > >